{"text_format":"1","workbook":"xlsx","n_sheets":12,"sheets":["Instructions & Notes","FormB_CPP_OA","FormA_CPP_OA_Q1","FormA_CPP_OA_Q2","FormA_CPP_OA_Q3","FormA_CPP_OA_Q4","Annexure-1","Annexure-2","StateUTs","DC Sectors with Thresholds","Targets","Supporting Sheet"],"not_rendered":{"charts":0,"images":4,"macros":1,"external_links":67,"defined_names":3008,"comments":0,"pivot_tables":0},"unopened":[],"bounds":{"document_bytes":16777216,"sheet_cells":100000,"rows_first":2000,"rows_last":500,"rows_between":2000,"halvings":0,"cell_chars":16384,"cell_head_chars":4096},"cells_cut":0,"cells_raw":0,"read":"whole","date_system":"1900"}

{"sheet":"Instructions & Notes","index":0,"n_rows":11,"n_cols":3,"rows_kept":11,"cut":false,"hidden":false,"merged":[[1,1,1,2],[2,1,2,2]]}
[]
[null,"RCO Compliance Data reporting by DCs with CPP & Open Access "]
[null,"Important Instructions and Notes:"]
[null,1,"This excel workbook contains the following worksheets:\n●  Form B (Worksheet name \"FormB_CPP_OA\") - The Annual Energy Consumption Details will appear in this worksheet\n●  Form A (Four Worksheets named \"FormA_CPP_OA_Q1\" to \"FormA_CPP_OA_Q4\") - The Quarterly Energy Consumption Details are to be entered in this sheet\n●  Annexure-1 (Worksheet name \"Annexure-1\") - This worksheet is to be used to enter all electricity generated in CPP for all quarters, and calculate the generation, net of auxiliary power consumption. \n●  Annexure-2 (Worksheet name \"Annexure-2\") - This sheet is to be used only in case of consumption of Green Hydrogen. The sheet estimates the electrical energy equivalent of Green Hydrogen consumed."]
[null,2,"Name, Address and other basic details of Obligated Designated Consumers to be entered in Form B (in Worksheet named \"FormB_CPP_OA\"). These details will be populated automatically in other sheets based on input in Form B"]
[null,3,"Renewable Consumption Obligations (%Target) specified by MoP will be auto-populated in the Form B and all Form As, once the Target Year (i.e. the financial year for which RCO Compliance is being evaluated) and Location (State) of the Designated Consumer is entered in Form B (in Worksheet named \"FormB_CPP_OA\")."]
[null,4,"Electrical Energy Consumption is to be entered in Million Units (MU) throughout all worksheets in this workbook. "]
[null,5,"Total Energy Consumption and Non-fossil Energy Consumption details to be entered in Form A for each of the respective Quarters (in Worksheets named \"FormA_CPP_OA_Q1\" to \"FormA_CPP_OA_Q4\"). Annual details will be populated from these sheets into Form B"]
[null,6,"Please refer carefully to the Legend and Notes provided on each worksheet while filling in the details"]
[null,7,"In case of combustion of non-fossil fuels in CPP, and for WHR system including auxiliary firing of fuel, worksheet named \"Annexure - 1\" should be used along with the values brought over from the Co-firing and WHR tool. In such cases, the duly populated formats from Co-firing and WHR tool should be appended along with this annexure. Calculations will be done in the tool and in Annexure - 1 and results will be populated in Form A for the respective quarter"]
[null,8,"In case of consumption of Green Hydrogen, the quarter wise details are to be filled in the Worksheet named \"Annexure-2\". Calculations will be done in the worksheet and results will be populated in Form A for the respective quarter"]

{"sheet":"FormB_CPP_OA","index":1,"n_rows":58,"n_cols":5,"rows_kept":58,"cut":false,"hidden":false,"merged":[[17,1,17,4],[1,1,1,4],[11,1,11,4],[8,2,8,4],[9,2,9,4],[2,2,2,4],[3,2,3,4],[5,2,5,4],[6,2,6,4],[7,2,7,4],[4,2,4,4],[46,1,46,4],[23,1,23,4],[47,1,47,4],[48,1,48,4],[51,1,51,4],[49,1,49,4],[35,1,35,4],[45,1,45,4]]}
[]
[null,"ANNUAL RCO COMPLIANCE DECLARATION FORM (FORM B) - DCs with CPP & Open Access"]
[null,"Name of Obligated Designated Consumer"]
[null,"Address"]
[null,"Energy Intensive Sector of Designated Consumer"]
[null,"Registration No. of Obligated Designated Consumer"]
[null,"Type of obligation(s) of Obligated Designated Consumer#"]
[null,"Target Year FY (__-__)"]
[null,"Location (State)"]
[null,"State Category",{"$f":"IF(ISBLANK(C9),\"\",VLOOKUP(C9,StateUTs!$B$2:$C$37,2))","v":""}]
[null,"Particulars","Nomenclature","Unit","Total Energy"]
[null,"Part A! – Gross Total Energy Consumption (Fossil based + Non-fossil based)"]
[null,"Gross Total Energy Consumption for Quarter 1","A","MU",{"$f":"FormA_CPP_OA_Q1!E39","v":0}]
[null,"Gross Total Energy Consumption for Quarter 2","B","MU",{"$f":"FormA_CPP_OA_Q2!E39","v":0}]
[null,"Gross Total Energy Consumption for Quarter 3","C","MU",{"$f":"FormA_CPP_OA_Q3!E39","v":0}]
{"$rows_left_out":44}
{"sheet":"FormA_CPP_OA_Q1","index":2,"n_rows":113,"n_cols":5,"rows_kept":113,"cut":false,"hidden":false,"merged":[[7,2,7,4],[9,2,9,4],[10,2,10,4],[11,1,11,4],[40,1,40,4],[8,2,8,4],[1,1,1,4],[2,2,2,4],[3,2,3,4],[5,2,5,4],[6,2,6,4],[4,2,4,4],[102,1,102,4],[104,1,104,4],[95,1,95,4],[106,1,106,4],[77,1,77,4],[105,1,105,4],[94,1,94,4],[99,1,99,4],[91,1,91,4],[103,1,103,4],[88,1,88,4],[93,1,93,4],[87,1,87,4],[97,1,97,4],[98,1,98,4],[96,1,96,4],[100,1,100,4],[90,1,90,4],[92,1,92,4],[101,1,101,4],[89,1,89,4]]}
[]
[null,"Quarterly RCO Compliance Data reporting (Form A) - DCs with CPP & Open Access "]
[null,"Name of Obligated Designated Consumer",{"$f":"FormB_CPP_OA!C3","v":0}]
[null,"Address",{"$f":"FormB_CPP_OA!C4","v":0}]
[null,"Energy Intensive Sector of Designated Consumer",{"$f":"FormB_CPP_OA!C5","v":0}]
[null,"Registration No. of Obligated Designated Consumer",{"$f":"FormB_CPP_OA!C6","v":0}]
[null,"Type of obligation(s) of Obligated Designated Consumer#",{"$f":"FormB_CPP_OA!C7","v":0}]
[null,"Target Year FY (__-__)",{"$f":"FormB_CPP_OA!C8","v":0}]
[null,"Quarter","Quarter 1 (01 April to 30 June)"]
[null,"Location - State",{"$f":"FormB_CPP_OA!C9","v":0}]
[null,"State Category",{"$f":"FormB_CPP_OA!C10","v":""}]
[null,"Part A – Gross Total Energy Consumption (Fossil based + Non-fossil based)"]
[null,"Particulars ","Nomenclature","Unit","Total Energy"]
[null,"Own Generation, Net after deducting APC*** (Sub-Total)","AT=A+A!-A**+B+T","MU",{"$f":"E15+E18-E19+E20+E21","v":0}]
[null,"Total Fossil based energy generation *","A = Acogen+Anon-cogen","MU",{"$f":"'Annexure-1'!F29","v":0}]
{"$rows_left_out":99}
{"sheet":"FormA_CPP_OA_Q2","index":3,"n_rows":115,"n_cols":5,"rows_kept":115,"cut":false,"hidden":false,"merged":[[106,1,106,4],[108,1,108,4],[105,1,105,4],[103,1,103,4],[99,1,99,4],[98,1,98,4],[101,1,101,4],[104,1,104,4],[87,1,87,4],[89,1,89,4],[92,1,92,4],[97,1,97,4],[102,1,102,4],[100,1,100,4],[96,1,96,4],[88,1,88,4],[93,1,93,4],[94,1,94,4],[95,1,95,4],[90,1,90,4],[91,1,91,4],[77,1,77,4],[1,1,1,4],[2,2,2,4],[3,2,3,4],[5,2,5,4],[6,2,6,4],[7,2,7,4],[11,1,11,4],[40,1,40,4],[8,2,8,4],[9,2,9,4],[10,2,10,4],[4,2,4,4]]}
[]
[null,"Quarterly RCO Compliance Data reporting (Form A) - DCs with CPP & Open Access "]
[null,"Name of Obligated Designated Consumer",{"$f":"FormB_CPP_OA!C3","v":0}]
[null,"Address",{"$f":"FormB_CPP_OA!C4","v":0}]
[null,"Energy Intensive Sector of Designated Consumer",{"$f":"FormB_CPP_OA!C5","v":0}]
[null,"Registration No. of Obligated Designated Consumer",{"$f":"FormB_CPP_OA!C6","v":0}]
[null,"Type of obligation(s) of Obligated Designated Consumer#",{"$f":"FormB_CPP_OA!C7","v":0}]
[null,"Target Year FY (__-__)",{"$f":"FormB_CPP_OA!C8","v":0}]
[null,"Quarter","Quarter 2 (01 July to 30 September)"]
[null,"Location - State",{"$f":"FormB_CPP_OA!C9","v":0}]
[null,"State Category",{"$f":"FormB_CPP_OA!C10","v":""}]
[null,"Part A – Gross Total Energy Consumption (Fossil based + Non-fossil based)"]
[null,"Particulars ","Nomenclature","Unit","Total Energy"]
[null,"Own Generation, Net after deducting APC*** (Sub-Total)","AT=A+A!-A**+B+T","MU",{"$f":"E15+E18-E19+E20+E21","v":0}]
[null,"Total Fossil based energy generation *","A = Acogen+Anon-cogen","MU",{"$f":"'Annexure-1'!G29","v":0}]
{"$rows_left_out":101}
{"sheet":"FormA_CPP_OA_Q3","index":4,"n_rows":115,"n_cols":5,"rows_kept":115,"cut":false,"hidden":false,"merged":[[106,1,106,4],[108,1,108,4],[105,1,105,4],[103,1,103,4],[99,1,99,4],[98,1,98,4],[101,1,101,4],[104,1,104,4],[87,1,87,4],[89,1,89,4],[92,1,92,4],[97,1,97,4],[102,1,102,4],[100,1,100,4],[96,1,96,4],[88,1,88,4],[93,1,93,4],[94,1,94,4],[95,1,95,4],[90,1,90,4],[91,1,91,4],[77,1,77,4],[1,1,1,4],[2,2,2,4],[3,2,3,4],[5,2,5,4],[6,2,6,4],[7,2,7,4],[11,1,11,4],[40,1,40,4],[8,2,8,4],[9,2,9,4],[10,2,10,4],[4,2,4,4]]}
[]
[null,"Quarterly RCO Compliance Data reporting (Form A) - DCs with CPP & Open Access "]
[null,"Name of Obligated Designated Consumer",{"$f":"FormB_CPP_OA!C3","v":0}]
[null,"Address",{"$f":"FormB_CPP_OA!C4","v":0}]
[null,"Energy Intensive Sector of Designated Consumer",{"$f":"FormB_CPP_OA!C5","v":0}]
[null,"Registration No. of Obligated Designated Consumer",{"$f":"FormB_CPP_OA!C6","v":0}]
[null,"Type of obligation(s) of Obligated Designated Consumer#",{"$f":"FormB_CPP_OA!C7","v":0}]
[null,"Target Year FY (__-__)",{"$f":"FormB_CPP_OA!C8","v":0}]
[null,"Quarter","Quarter 3 (01 October to 31 December)"]
[null,"Location - State",{"$f":"FormB_CPP_OA!C9","v":0}]
[null,"State Category",{"$f":"FormB_CPP_OA!C10","v":""}]
[null,"Part A – Gross Total Energy Consumption (Fossil based + Non-fossil based)"]
[null,"Particulars ","Nomenclature","Unit","Total Energy"]
[null,"Own Generation, Net after deducting APC*** (Sub-Total)","AT=A+A!-A**+B+T","MU",{"$f":"E15+E18-E19+E20+E21","v":0}]
[null,"Total Fossil based energy generation *","A = Acogen+Anon-cogen","MU",{"$f":"'Annexure-1'!H29","v":0}]
{"$rows_left_out":101}
{"sheet":"FormA_CPP_OA_Q4","index":5,"n_rows":115,"n_cols":5,"rows_kept":115,"cut":false,"hidden":false,"merged":[[106,1,106,4],[108,1,108,4],[105,1,105,4],[103,1,103,4],[99,1,99,4],[98,1,98,4],[101,1,101,4],[104,1,104,4],[87,1,87,4],[89,1,89,4],[92,1,92,4],[97,1,97,4],[102,1,102,4],[100,1,100,4],[88,1,88,4],[96,1,96,4],[93,1,93,4],[94,1,94,4],[95,1,95,4],[90,1,90,4],[91,1,91,4],[77,1,77,4],[1,1,1,4],[2,2,2,4],[3,2,3,4],[5,2,5,4],[6,2,6,4],[7,2,7,4],[11,1,11,4],[40,1,40,4],[8,2,8,4],[9,2,9,4],[10,2,10,4],[4,2,4,4]]}
[]
[null,"Quarterly RCO Compliance Data reporting (Form A) - DCs with CPP & Open Access "]
[null,"Name of Obligated Designated Consumer",{"$f":"FormB_CPP_OA!C3","v":0}]
[null,"Address",{"$f":"FormB_CPP_OA!C4","v":0}]
[null,"Energy Intensive Sector of Designated Consumer",{"$f":"FormB_CPP_OA!C5","v":0}]
[null,"Registration No. of Obligated Designated Consumer",{"$f":"FormB_CPP_OA!C6","v":0}]
[null,"Type of obligation(s) of Obligated Designated Consumer#",{"$f":"FormB_CPP_OA!C7","v":0}]
[null,"Target Year FY (__-__)",{"$f":"FormB_CPP_OA!C8","v":0}]
[null,"Quarter","Quarter 4 (01 January to 31 March)"]
[null,"Location - State",{"$f":"FormB_CPP_OA!C9","v":0}]
[null,"State Category",{"$f":"FormB_CPP_OA!C10","v":""}]
[null,"Part A – Gross Total Energy Consumption (Fossil based + Non-fossil based)"]
[null,"Particulars ","Nomenclature","Unit","Total Energy"]
[null,"Own Generation, Net after deducting APC*** (Sub-Total)","AT=A+A!-A**+B+T","MU",{"$f":"E15+E18-E19+E20+E21","v":0}]
[null,"Total Fossil based energy generation *","A = Acogen+Anon-cogen","MU",{"$f":"'Annexure-1'!I29","v":0}]
{"$rows_left_out":101}
{"sheet":"Annexure-1","index":6,"n_rows":57,"n_cols":10,"rows_kept":57,"cut":false,"hidden":false,"merged":[[50,2,50,9],[42,2,42,9],[46,2,46,9],[36,2,36,9],[37,2,37,9],[39,2,39,9],[38,2,38,9],[40,2,40,9],[45,2,45,9],[41,2,41,9],[43,2,43,9],[44,2,44,9],[47,2,47,9],[48,2,48,9],[35,3,35,4],[1,2,1,9],[35,5,35,7],[35,8,35,9],[2,2,2,9],[19,2,19,9],[4,2,4,9]]}
[]
[null,null,"Annexure – 1: Electricity Generated from CPP"]
[null,null,"(For combustion of non-fossil fuels, and for auxiliary firing of fuel in WHR system, Values to be brought over from Co-firing and WHR Tool, 'CPPSummary' sheet for respective quarters)"]
[]
[null,null,"(Gross Values Inclusive of Auxiliary Power Consumption)"]
[null,null,"Particulars ","Nomenclature","Unit","Quarter 1","Quarter 2","Quarter 3","Quarter 4","Annual"]
[null,null,"Total Electricity Generation from CPP during the quarter","ECPP = Ecogen + Enon-cogen","MU",{"$f":"F8+F9","v":0},{"$f":"G8+G9","v":0},{"$f":"H8+H9","v":0},{"$f":"I8+I9","v":0},{"$f":"SUM(F7:I7)","v":0}]
[null,null,"Total Electricity Generation from CPP through Co-gen during the quarter $","Ecogen","MU",null,null,null,null,0]
[null,null,"Total Electricity Generation from CPP other than Co-gen during the quarter %%","Enon-cogen","MU",null,null,null,null,0]
[null,null,"Total electrical energy generated by Microturbines (connected across PRDS/PRV) during the quarter","Emicro","MU",null,null,null,null,0]
[null,null,"Total Nuclear Electricity Generation during the quarter","Enuclear","MU",null,null,null,null,0]
[null,null,"Total electrical energy generated by Fossil Fuels during the quarter *","EfCPP = ECPP + Emicro - ErCPP","MU",{"$f":"F7+F10-F15","v":0},{"$f":"G7+G10-G15","v":0},0,0,0]
[null,null,"Total electrical energy generated by Fossil Fuel Co-gen during the quarter","Efcogen = Eco-gen + Emicro \n- ErCPP *(Ecogen/ECPP)","MU",{"$f":"IF(F7=0,0,F8+F10-F15*(F8/F7))","v":0},{"$f":"IF(G7=0,0,G8+G10-G15*(G8/G7))","v":0},{"$f":"IF(H7=0,0,H8+H10-H15*(H8/H7))","v":0},{"$f":"IF(I7=0,0,I8+I10-I15*(I8/I7))","v":0},0]
[null,null,"Total electrical energy generated other than Co-gen by Fossil Fuel during the quarter","Efnon-cogen = Enon-cogen \n- ErCPP *(Enon-cogen/ECPP)","MU",{"$f":"IF(F7=0,0,F9-F15*(F9/F7))","v":0},{"$f":"IF(G7=0,0,G9-G15*(G9/G7))","v":0},{"$f":"IF(H7=0,0,H9-H15*(H9/H7))","v":0},{"$f":"IF(I7=0,0,I9-I15*(I9/I7))","v":0},0]
[null,null,"Total electrical energy generated by bio-mass (or other renewable sources) during the quarter #","ErCPP","MU",null,null,null,null,0]
{"$rows_left_out":43}
{"sheet":"Annexure-2","index":7,"n_rows":34,"n_cols":19,"rows_kept":34,"cut":false,"hidden":false,"merged":[[1,1,1,8],[20,1,20,8],[22,3,22,7],[3,1,5,2],[7,1,8,1],[7,2,8,2],[7,8,8,8],[19,1,19,8],[10,1,10,8],[22,13,22,17],[19,10,19,18],[5,3,5,7],[4,3,4,7],[3,3,3,7]]}
[]
[null,"Annexure – 2: Estimation of electricity required for production of Green Hydrogen"]
[]
[null,"Legend",null,"Data to be Entered by User"]
[null,null,null,"Data Entry Not Allowed"]
[null,null,null,"Calculated Data"]
[]
[null,"GrandTotal - Energy Equivalent of GH2 consumed (Case # 1 + Case # 2)","MU","Quarter 1","Quarter 2","Quarter 3","Quarter 4","Annual","Note: The Quarter wise Energy Equivalent of GH2 consumed is automatically reflected in the Form A of respective quarter."]
[null,null,null,{"$f":"D24+N24","v":0},{"$f":"E24+O24","v":0},0,0,{"$f":"SUM(D9:G9)","v":0}]
[]
[null,"Undertaking\nI/We undertake that the information supplied in this Renewable Consumption Obligations Compliance Declaration Form (Annexure - 2) For Obligated Designated Consumers is accurate to the best of my knowledge and if any of the information supplied is found to be incorrect and such information results into loss to the Central Government or any of the authority under them or any other person affected, I/we undertake to indemnify such loss.\nI /We agree to extend necessary assistance in case of any enquiry to be made in the matter."]
[null,"For Obligated DC",null,null,null,null,null,null,"For Empaneled AEA Agency"]
[]
[]
[]
{"$rows_left_out":20}
{"sheet":"StateUTs","index":8,"n_rows":37,"n_cols":7,"rows_kept":37,"cut":false,"hidden":true,"merged":[]}
["Sl No.","State/ UT","State category"]
[35,"Andaman and Nicobar Island","Normal",null,null,"Target Quarter","Type of obligation(s) of Obligated Designated Consumer#"]
[1,"Andhra Pradesh","Normal",null,null,"Q1","Discom"]
[2,"Arunachal Pradesh","NER",null,null,"Q2","Captive Power Plant(CPP)"]
[3,"Assam","NER",null,null,"Q3","Open Access"]
[4,"Bihar","Normal",null,null,"Q4"]
[32,"Chandigarh","Normal"]
[5,"Chhattisgarh","Normal"]
[33,"Daman & Diu and Dadra & Nagar Haveli","Normal"]
[6,"Delhi","Normal"]
[7,"Goa","Normal"]
[8,"Gujarat","Normal"]
[9,"Haryana","Normal"]
[10,"Himachal Pradesh","Hilly"]
[11,"Jammu & Kashmir","Hilly"]
{"$rows_left_out":23}
{"sheet":"DC Sectors with Thresholds","index":9,"n_rows":47,"n_cols":4,"rows_kept":47,"cut":false,"hidden":true,"merged":[]}
[]
["S.No"," Notified Sector","Threshold Energy Consumption in Metric tonne of oil equivalent (mtoe) per year and above.","DC Sectors with Thresholds"]
[3,"Cement:"]
[6,"Chemical"]
[7,"Commercial Building or establishments:"]
[19,"Petrochemical Manufacturing units:"]
[21,"Railway"]
[1,"Aluminum",7500,{"$f":"CONCATENATE(B8,\", Threshold: \", C8, \" toe\")","v":"Aluminum, Threshold: 7500 toe"}]
[2,"Automobile Assembly Unit",3000,{"$f":"CONCATENATE(B9,\", Threshold: \", C9, \" toe\")","v":"Automobile Assembly Unit, Threshold: 3000 toe"}]
[null,"Cement : Integrated Cement Unit",30000,{"$f":"CONCATENATE(B10,\", Threshold: \", C10, \" toe\")","v":"Cement : Integrated Cement Unit, Threshold: 30000 toe"}]
[null,"Cement : Cement grinding Unit",10000,"Cement : Cement grinding Unit, Threshold: 10000 toe"]
[4,"Ceramic",5000,"Ceramic, Threshold: 5000 toe"]
[5,"Chlor_Alkali",12000,"Chlor_Alkali, Threshold: 12000 toe"]
[null,"Chemical : Alkali Chemical (Soda Ash, Potassium Hydroxide)",3000,"Chemical : Alkali Chemical (Soda Ash, Potassium Hydroxide), Threshold: 3000 toe"]
[null,"Chemical : Inorganic Chemicals",3000,"Chemical : Inorganic Chemicals, Threshold: 3000 toe"]
{"$rows_left_out":33}
{"sheet":"Targets","index":10,"n_rows":20,"n_cols":8,"rows_kept":20,"cut":false,"hidden":true,"merged":[]}
[null,null,null,"Wind RE","Hydro RE","Distributed RE","Other RE","Total"]
[null,"State category","FY","Wind renewable energy","Hydro renewable energy","Distributed renewable energy*","Other renewable energy","Total renewable energy"]
[null,"Normal","2024-25",6.7000000000000002E-3,3.8E-3,1.4999999999999999E-2,0.27350000000000002,0.29909999999999998]
[null,"Normal","2025-26",1.4500000000000001E-2,1.2200000000000001E-2,2.1000000000000001E-2,0.28239999999999998,0.3301]
[null,"Normal","2026-27",1.9699999999999999E-2,1.34E-2,2.7E-2,0.2994,0.35949999999999999]
[null,"Normal","2027-28",2.4500000000000001E-2,1.4200000000000001E-2,3.3000000000000002E-2,0.31640000000000001,0.3881]
[null,"Normal","2028-29",2.9499999999999998E-2,1.4200000000000001E-2,3.9E-2,0.33100000000000002,0.41360000000000002]
[null,"Normal","2029-30",3.4799999999999998E-2,1.3299999999999999E-2,4.4999999999999998E-2,0.3402,0.43330000000000002]
[null,"Hilly","2024-25",6.7000000000000002E-3,3.8E-3,7.4999999999999997E-3,0.28100000000000003,0.29909999999999998]
[null,"Hilly","2025-26",1.4500000000000001E-2,1.2200000000000001E-2,1.0500000000000001E-2,0.29289999999999999,0.3301]
[null,"Hilly","2026-27",1.9699999999999999E-2,1.34E-2,1.35E-2,0.31290000000000001,0.35949999999999999]
[null,"Hilly","2027-28",2.4500000000000001E-2,1.4200000000000001E-2,1.6500000000000001E-2,0.33290000000000003,0.3881]
[null,"Hilly","2028-29",2.9499999999999998E-2,1.4200000000000001E-2,1.95E-2,0.35050000000000003,0.41360000000000002]
[null,"Hilly","2029-30",3.4799999999999998E-2,1.3299999999999999E-2,2.2499999999999999E-2,0.36270000000000002,0.43330000000000002]
[null,"NER","2024-25",6.7000000000000002E-3,3.8E-3,7.4999999999999997E-3,0.28100000000000003,0.29909999999999998]
{"$rows_left_out":6}
{"sheet":"Supporting Sheet","index":11,"n_rows":23,"n_cols":14,"rows_kept":23,"cut":false,"hidden":true,"merged":[[13,9,14,9],[7,9,8,9],[9,9,10,9],[11,9,12,9],[3,9,4,9],[5,9,6,9]]}
[]
[]
[null,null,"Source of RE",null,"Power Market","Mode of compliance","Type of Plant","Non- Fossil Energy","TYPE OF CONTRACT","Source","Voltage level","Nature of Load",null,"Type of obligation(s) of Obligated Designated Consumer"]
[null,null,"Solar PV and solar thermal power",null,"Power Exchange","RE Own Generation","On Grid","RE Own Generation","Long Term","Thermal","400KV","Base Load",null,"Distribution licensee (DISCOM)"]
[null,null,"Wind Energy",null,"Bilateral ","RE Purchase","Off Grid","RE Purchase","Medium Term",null,"132KV","Seasonal Load",null,"Open Access(OA)"]
[null,null,"All Hydro Power including Large Hydro Projects (LHPs), Pumped Storage Projects (PSPs) and Small Hydro Projects (SHPs).",null,"N/A","REC",null,"REC","Short Term","Wind","220KV","Diurnal Load",null,"Captive power plant(CPP)"]
[null,null,"Wind Energy",null,null,"Energy Equivalent of Green Hydrogen consumed (in SCM)",null,"Energy Equivalent of Green Hydrogen consumed (in SCM)",null,null,"66KV"]
[null,null,"All Hydro Power including Large Hydro Projects (LHPs), Pumped Storage Projects (PSPs) and Small Hydro Projects (SHPs).",null,null,"Energy Equivalent of Green Ammonia consumed (in Tons)",null,"Energy Equivalent of Green Ammonia consumed (in Tons)",null,"Nuclear","33KV"]
[null,null,"Non-fossil fuel (including Bagasse) based co-generation projects.",null,null,null,null,null,null,null,"11KV"]
[null,null,"Biomass Power based on Rankine cycle and combined cycle technologies. ",null,null,null,null,null,null,"Small hydro"]
[null,null,"Biomass Gasifier based power. "]
[null,null,"Biogas based power. ",null,null,null,null,null,null,"Solar"]
[null,null,"Waste to Energy"]
[null,null,"Geothermal Power ",null,null,null,null,null,null,"Thermal"]
[null,null,"Tidal Power"]
{"$rows_left_out":8}